Reaction Details
TargetMAP kinase-activated protein kinase 2
LigandBDBM50045394
Substrate/Competitorn/a
Meas. Tech.ChEMBL_1458999 (CHEMBL3369592)
IC50 75±n/a nM
Citation Xiao, DZhu, XSofolarides, MDegrado, SShao, NRao, AChen, XAslanian, RFossetta, JTian, FTrivedi, PLundell, DPalani, A Discovery of a novel series of potent MK2 non-ATP competitive inhibitors using 1,2-substituted azoles as cis-amide isosteres. Bioorg Med Chem Lett24:3609-13 (2014) 
 
MAP kinase-activated protein kinase 2
Name:MAP kinase-activated protein kinase 2
Type:Serine/threonine-protein kinase
Mol. Mass.:45579.87
Organism:Homo sapiens (Human)
Description:P49137
Residue:400
BDBM50045394
NameBDBM50045394
Synonyms:CHEMBL3315288
TypeSmall organic molecule
Emp. Form.C23H20ClN3O2
Mol. Mass.405.877
SMILESClc1ccc(cc1)-c1ccc(o1)-c1nccn1-c1ccc(cc1)[C@@H]1CNCCO1