Reaction Details
TargetMAP kinase-activated protein kinase 2
LigandBDBM50045415
Substrate/Competitorn/a
Meas. Tech.ChEMBL_1458999 (CHEMBL3369592)
IC50 22±n/a nM
Citation Xiao, DZhu, XSofolarides, MDegrado, SShao, NRao, AChen, XAslanian, RFossetta, JTian, FTrivedi, PLundell, DPalani, A Discovery of a novel series of potent MK2 non-ATP competitive inhibitors using 1,2-substituted azoles as cis-amide isosteres. Bioorg Med Chem Lett24:3609-13 (2014) 
 
MAP kinase-activated protein kinase 2
Name:MAP kinase-activated protein kinase 2
Type:Serine/threonine-protein kinase
Mol. Mass.:45579.87
Organism:Homo sapiens (Human)
Description:P49137
Residue:400
BDBM50045415
NameBDBM50045415
Synonyms:CHEMBL3314150
TypeSmall organic molecule
Emp. Form.C24H20BrN5O
Mol. Mass.474.352
SMILESBrc1cc(ccc1-n1ccnc1-c1ccc(o1)-c1ccc(cc1)C#N)N1CCNCC1