Reaction Details
TargetP2Y purinoceptor 1
LigandBDBM50045601
Substrate/Competitorn/a
Meas. Tech.ChEMBL_1454530 (CHEMBL3365972)
IC50 0.510000±n/a nM
Citation Yang, WWang, YLai, AQiao, JXWang, TCHua, JPrice, LAShen, HChen, XQWong, PCrain, EWatson, CHuang, CSSeiffert, DARehfuss, RWexler, RRLam, PY Discovery of 4-aryl-7-hydroxyindoline-based P2Y1 antagonists as novel antiplatelet agents. J Med Chem57:6150-64 (2014) 
 
P2Y purinoceptor 1
Name:P2Y purinoceptor 1
Type:Enzyme
Mol. Mass.:42090.25
Organism:Homo sapiens (Human)
Description:P47900
Residue:373
BDBM50045601
NameBDBM50045601
Synonyms:CHEMBL3314315 US9540323, example 135
TypeSmall organic molecule
Emp. Form.C30H23F7N4O3
Mol. Mass.620.5174
SMILESCC1(C)CN(c2c1c(c(F)cc2O)-c1ccc(nc1)C(F)(F)F)c1ccccc1NC(=O)Nc1ccc(OC(F)(F)F)cc1