Reaction Details
TargetP2Y purinoceptor 1
LigandBDBM50045628
Substrate/Competitorn/a
Meas. Tech.ChEMBL_1454531 (CHEMBL3365973)
IC50 90±n/a nM
Citation Yang, WWang, YLai, AQiao, JXWang, TCHua, JPrice, LAShen, HChen, XQWong, PCrain, EWatson, CHuang, CSSeiffert, DARehfuss, RWexler, RRLam, PY Discovery of 4-aryl-7-hydroxyindoline-based P2Y1 antagonists as novel antiplatelet agents. J Med Chem57:6150-64 (2014) 
 
P2Y purinoceptor 1
Name:P2Y purinoceptor 1
Type:Enzyme
Mol. Mass.:42090.25
Organism:Homo sapiens (Human)
Description:P47900
Residue:373
BDBM50045628
NameBDBM50045628
Synonyms:CHEMBL3314308 US9540323, example 202
TypeSmall organic molecule
Emp. Form.C38H43FN4O2
Mol. Mass.606.772
SMILESCC(C)(C)CN1CCCC1c1ccc(NC(=O)Nc2ccccc2N2CC(C)(C)c3c2c(O)ccc3-c2ccc(F)cc2)cc1