Reaction Details
TargetP2Y purinoceptor 1
LigandBDBM50045617
Substrate/Competitorn/a
Meas. Tech.ChEMBL_1454530 (CHEMBL3365972)
IC50 0.330000±n/a nM
Citation Yang, WWang, YLai, AQiao, JXWang, TCHua, JPrice, LAShen, HChen, XQWong, PCrain, EWatson, CHuang, CSSeiffert, DARehfuss, RWexler, RRLam, PY Discovery of 4-aryl-7-hydroxyindoline-based P2Y1 antagonists as novel antiplatelet agents. J Med Chem57:6150-64 (2014) 
 
P2Y purinoceptor 1
Name:P2Y purinoceptor 1
Type:Enzyme
Mol. Mass.:42090.25
Organism:Homo sapiens (Human)
Description:P47900
Residue:373
BDBM50045617
NameBDBM50045617
Synonyms:CHEMBL3314298 US9540323, example 193
TypeSmall organic molecule
Emp. Form.C30H25F4N3O3
Mol. Mass.551.5314
SMILESCC1(C)CN(c2c1c(ccc2O)-c1ccc(F)cc1)c1ccccc1NC(=O)Nc1ccc(OC(F)(F)F)cc1