Reaction Details
TargetP2Y purinoceptor 1
LigandBDBM50045629
Substrate/Competitorn/a
Meas. Tech.ChEMBL_1454530 (CHEMBL3365972)
IC50 0.230000±n/a nM
Citation Yang, WWang, YLai, AQiao, JXWang, TCHua, JPrice, LAShen, HChen, XQWong, PCrain, EWatson, CHuang, CSSeiffert, DARehfuss, RWexler, RRLam, PY Discovery of 4-aryl-7-hydroxyindoline-based P2Y1 antagonists as novel antiplatelet agents. J Med Chem57:6150-64 (2014) 
 
P2Y purinoceptor 1
Name:P2Y purinoceptor 1
Type:Enzyme
Mol. Mass.:42090.25
Organism:Homo sapiens (Human)
Description:P47900
Residue:373
BDBM50045629
NameBDBM50045629
Synonyms:CHEMBL3314309 US9540323, example 194
TypeSmall organic molecule
Emp. Form.C30H24F5N3O3
Mol. Mass.569.5219
SMILESCC1(C)CN(c2c1c(c(F)cc2O)-c1ccc(F)cc1)c1ccccc1NC(=O)Nc1ccc(OC(F)(F)F)cc1