Reaction Details
TargetIndoleamine 2,3-dioxygenase 1
LigandBDBM50046109
Substrate/Competitorn/a
Meas. Tech.ChEMBL_1458164 (CHEMBL3368210)
IC50 59±n/a nM
Citation Cheng, MFHung, MSSong, JSLin, SYLiao, FYWu, MHHsiao, WHsieh, CLWu, JSChao, YSShih, CWu, SYUeng, SH Discovery and structure-activity relationships of phenyl benzenesulfonylhydrazides as novel indoleamine 2,3-dioxygenase inhibitors. Bioorg Med Chem Lett24:3403-6 (2014) 
 
Indoleamine 2,3-dioxygenase 1
Name:Indoleamine 2,3-dioxygenase 1
Type:Enzyme
Mol. Mass.:45330.80
Organism:Homo sapiens (Human)
Description:P14902
Residue:403
BDBM50046109
NameBDBM50046109
Synonyms:CHEMBL3310845
TypeSmall organic molecule
Emp. Form.C19H16F3N3O3S
Mol. Mass.423.409
SMILESCc1cccc(NNS(=O)(=O)c2ccc(Oc3ccc(cn3)C(F)(F)F)cc2)c1