Reaction Details
TargetLysine-specific demethylase 4A
LigandBDBM50047962
Substrate/Competitorn/a
Meas. Tech.ChEMBL_1451998 (CHEMBL3363700)
Ki 5500±n/a nM
Citation Chu, CHWang, LYHsu, KCChen, CCCheng, HHWang, SMWu, CMChen, TJLi, LTLiu, RHung, CLYang, JMKung, HJWang, WC KDM4B as a target for prostate cancer: structural analysis and selective inhibition by a novel inhibitor. J Med Chem57:5975-85 (2014) 
 
Lysine-specific demethylase 4A
Name:Lysine-specific demethylase 4A
Type:Enzyme
Mol. Mass.:120647.83
Organism:Homo sapiens (Human)
Description:O75164
Residue:1064
BDBM50047962
NameBDBM50047962
Synonyms:CHEMBL1966136
TypeSmall organic molecule
Emp. Form.C22H12Cl4N2O4
Mol. Mass.510.154
SMILES[O-][N+](=O)c1cc(c(\C=C\c2ccc(Cl)c(Cl)c2)cc1\C=C\c1ccc(Cl)c(Cl)c1)[N+]([O-])=O