Reaction Details
TargetPolymerase basic protein 2
LigandBDBM50050717
Substrate/Competitorn/a
Meas. Tech.ChEMBL_1458393 (CHEMBL3369823)
Kd 90±n/a nM
Citation Clark, MPLedeboer, MWDavies, IByrn, RAJones, SMPerola, ETsai, AJacobs, MNti-Addae, KBandarage, UKBoyd, MJBethiel, RSCourt, JJDeng, HDuffy, JPDorsch, WAFarmer, LJGao, HGu, WJackson, KJacobs, DHKennedy, JMLedford, BLiang, JMaltais, FMurcko, MWang, TWannamaker, MWBennett, HBLeeman, JRMcNeil, CTaylor, WPMemmott, CJiang, MRijnbrand, RBral, CGermann, UNezami, AZhang, YSalituro, FGBennani, YLCharifson, PS Discovery of a novel, first-in-class, orally bioavailable azaindole inhibitor (VX-787) of influenza PB2. J Med Chem57:6668-78 (2014) 
 
Polymerase basic protein 2
Name:Polymerase basic protein 2
Type:PROTEIN
Mol. Mass.:86120.80
Organism:Influenza A virus (strain A/Puerto Rico/8/1934 H1N1)
Description:ChEMBL_109460
Residue:759
BDBM50050717
NameBDBM50050717
Synonyms:CHEMBL3317991
TypeSmall organic molecule
Emp. Form.C22H22F2N8O
Mol. Mass.452.4599
SMILESCn1cncc1C(=O)N[C@@H]1CCC[C@@H](C1)Nc1nc(ncc1F)-c1c[nH]c2ncc(F)cc12