Reaction Details
TargetXanthine dehydrogenase/oxidase
LigandBDBM7459
Substrate/Competitorn/a
Meas. Tech.ChEMBL_1459244 (CHEMBL3367270)
Ki 2900±n/a nM
Citation Singh, MKaur, MSilakari, O Flavones: an important scaffold for medicinal chemistry. Eur J Med Chem84:206-39 (2014) 
 
Xanthine dehydrogenase/oxidase
Name:Xanthine dehydrogenase/oxidase
Type:Enzyme
Mol. Mass.:146441.21
Organism:Homo sapiens (Human)
Description:P47989
Residue:1333
BDBM7459
NameBDBM7459
Synonyms:2-(3,4-dihydroxyphenyl)-5,7-dihydroxy-4H-chromen-4-one CHEMBL151 Luteolin (4) cid_5280445 med.21724, Compound 3
TypeSmall organic molecule
Emp. Form.C15H10O6
Mol. Mass.286.2363
SMILESOc1cc(O)c2c(c1)oc(cc2=O)-c1ccc(O)c(O)c1