Reaction Details
TargetIndoleamine 2,3-dioxygenase 1
LigandBDBM50051818
Substrate/Competitorn/a
Meas. Tech.ChEMBL_1452152 (CHEMBL3365098)
IC50 31000±n/a nM
Citation Röhrig, UFMajjigapu, SRChambon, MBron, SPilotte, LColau, DVan den Eynde, BJTurcatti, GVogel, PZoete, VMichielin, O Detailed analysis and follow-up studies of a high-throughput screening for indoleamine 2,3-dioxygenase 1 (IDO1) inhibitors. Eur J Med Chem84:284-301 (2014) 
 
Indoleamine 2,3-dioxygenase 1
Name:Indoleamine 2,3-dioxygenase 1
Type:Enzyme
Mol. Mass.:45330.80
Organism:Homo sapiens (Human)
Description:P14902
Residue:403
BDBM50051818
NameBDBM50051818
Synonyms:CHEMBL3318333
TypeSmall organic molecule
Emp. Form.C16H15ClN6
Mol. Mass.326.784
SMILESCc1ccc(cc1)-n1nnnc1C\C=N\Nc1ccc(Cl)cc1