Reaction Details
TargetAurora kinase B
LigandBDBM50052075
Substrate/Competitorn/a
Meas. Tech.ChEMBL_1453020 (CHEMBL3362102)
IC50 2.9±n/a nM
Citation Wang, HCJagtap, ADChang, PTLiu, JRLiu, CPTseng, HWChen, GSChern, JW Bioisosteric replacement of an acylureido moiety attached to an indolin-2-one scaffold with a malonamido or a 2/4-pyridinoylamido moiety produces a selectively potent Aurora-B inhibitor. Eur J Med Chem84:312-34 (2014) 
 
Aurora kinase B
Name:Aurora kinase B
Type:Protein
Mol. Mass.:39327.72
Organism:Homo sapiens (Human)
Description:Q96GD4
Residue:344
BDBM50052075
NameBDBM50052075
Synonyms:CHEMBL3322595
TypeSmall organic molecule
Emp. Form.C32H28FN5O5
Mol. Mass.581.5936
SMILESCc1[nH]c(\C=C2/C(=O)Nc3cc(NC(=O)c4c[nH]cc(-c5ccc(F)cc5)c4=O)ccc23)c(C)c1C(=O)N1CCOCC1