Reaction Details
TargetPlatelet-derived growth factor receptor beta
LigandBDBM50051942
Substrate/Competitorn/a
Meas. Tech.ChEMBL_1453025 (CHEMBL3362107)
IC50 87±n/a nM
Citation Wang, HCJagtap, ADChang, PTLiu, JRLiu, CPTseng, HWChen, GSChern, JW Bioisosteric replacement of an acylureido moiety attached to an indolin-2-one scaffold with a malonamido or a 2/4-pyridinoylamido moiety produces a selectively potent Aurora-B inhibitor. Eur J Med Chem84:312-34 (2014) 
 
Platelet-derived growth factor receptor beta
Name:Platelet-derived growth factor receptor beta
Type:Enzyme
Mol. Mass.:123922.25
Organism:Homo sapiens (Human)
Description:P09619
Residue:1106
BDBM50051942
NameBDBM50051942
Synonyms:CHEMBL3322563
TypeSmall organic molecule
Emp. Form.C22H17FN4O3
Mol. Mass.404.3938
SMILESFc1ccc(NC(=O)CC(=O)Nc2ccc3\C(=C\c4ccc[nH]4)C(=O)Nc3c2)cc1