Reaction Details
TargetVascular endothelial growth factor receptor 2
LigandBDBM50051957
Substrate/Competitorn/a
Meas. Tech.ChEMBL_1453019 (CHEMBL3362101)
IC50 21±n/a nM
Citation Wang, HCJagtap, ADChang, PTLiu, JRLiu, CPTseng, HWChen, GSChern, JW Bioisosteric replacement of an acylureido moiety attached to an indolin-2-one scaffold with a malonamido or a 2/4-pyridinoylamido moiety produces a selectively potent Aurora-B inhibitor. Eur J Med Chem84:312-34 (2014) 
 
Vascular endothelial growth factor receptor 2
Name:Vascular endothelial growth factor receptor 2
Type:Receptor Tyrosine Kinase
Mol. Mass.:151510.97
Organism:Homo sapiens (Human)
Description:P35968
Residue:1356
BDBM50051957
NameBDBM50051957
Synonyms:CHEMBL3322566
TypeSmall organic molecule
Emp. Form.C32H36N6O5
Mol. Mass.584.6654
SMILESCOc1ccc(NC(=O)CC(=O)Nc2ccc3\C(=C\c4[nH]c(C)c(C(=O)NCCN5CCCC5)c4C)C(=O)Nc3c2)cc1