Reaction Details
Target11-beta-hydroxysteroid dehydrogenase 1
LigandBDBM50054701
Substrate/Competitorn/a
Meas. Tech.ChEMBL_1453118 (CHEMBL3364416)
IC50 0.500000±n/a nM
Citation Li, JKennedy, LJWang, HLi, JJWalker, SJHong, ZO'Connor, SPNayeem, ACamac, DMMorin, PESheriff, SWang, MHarper, TGolla, RSeethala, RHarrity, TPonticiello, RPMorgan, NNTaylor, JRZebo, RGordon, DARobl, JA Optimization of 1,2,4-Triazolopyridines as Inhibitors of Human 11ß-Hydroxysteroid Dehydrogenase Type 1 (11ß-HSD-1). ACS Med Chem Lett5:803-8 (2014) 
 
11-beta-hydroxysteroid dehydrogenase 1
Name:11-beta-hydroxysteroid dehydrogenase 1
Type:Enzyme
Mol. Mass.:32409.16
Organism:Homo sapiens (Human)
Description:P28845
Residue:292
BDBM50054701
NameBDBM50054701
Synonyms:CHEMBL3318967
TypeSmall organic molecule
Emp. Form.C22H15ClF3N3O2
Mol. Mass.445.822
SMILESFC(F)(F)Oc1ccccc1Oc1cccn2c(nnc12)C1(CC1)c1ccc(Cl)cc1