Reaction Details
TargetSimilar to alpha-tubulin isoform 1
LigandBDBM50005480
Substrate/Competitorn/a
Meas. Tech.ChEMBL_1454845 (CHEMBL3363844)
IC50 1200±n/a nM
Citation Porců, ESipos, ABasso, GHamel, EBai, RStempfer, VUdvardy, ABényei, ACSchmidhammer, HAntus, SViola, G Novel 9'-substituted-noscapines: synthesis with Suzuki cross-coupling, structure elucidation and biological evaluation. Eur J Med Chem84:476-90 (2014) 
 
Similar to alpha-tubulin isoform 1
Name:Similar to alpha-tubulin isoform 1
Synonyms:Similar to alpha-tubulin isoform 1
Type:PROTEIN
Mol. Mass.:10383.05
Organism:Bos taurus
Description:ChEMBL_104716
Residue:99
BDBM50005480
NameBDBM50005480
TypeSmall organic molecule
Emp. Form.C18H20O5
Mol. Mass.316.3484
SMILESCOc1ccc(\C=C/c2cc(OC)c(OC)c(OC)c2)cc1O