Reaction Details
TargetD(3) dopamine receptor
LigandBDBM50055262
Substrate/Competitorn/a
Meas. Tech.ChEMBL_1449716 (CHEMBL3378139)
Ki 64±n/a nM
Citation Arnold, NBeattie, DBradley, MBrearley, ABrown, LCharlton, SJFairhurst, RAFarr, DFozard, JFullerton, JGosling, MHatto, JJanus, DJones, DJordan, LLewis, CMaas, JMcCarthy, CMercer, MOakman, HPress, NProfit, RSchuerch, FSykes, DTaylor, RJTrifilieff, ATuffnell, A The identification of 7-[(R)-2-((1S,2S)-2-benzyloxycyclopentylamino)-1-hydroxyethyl]-4-hydroxybenzothiazolone as an inhaled long-actingß2-adrenoceptor agonist. Bioorg Med Chem Lett24:4341-7 (2014) 
 
D(3) dopamine receptor
Name:D(3) dopamine receptor
Type:n/a
Mol. Mass.:44243.43
Organism:Homo sapiens (Human)
Description:n/a
Residue:400
BDBM50055262
NameBDBM50055262
Synonyms:CHEMBL3323656
TypeSmall organic molecule
Emp. Form.C20H28N2O3S
Mol. Mass.376.513
SMILESO[C@@H](CN[C@H]1CCC[C@H]1C1CCCCC1)c1ccc(O)c2[nH]c(=O)sc12