Reaction Details
TargetD(3) dopamine receptor
LigandBDBM50324856
Substrate/Competitorn/a
Meas. Tech.ChEMBL_1449716 (CHEMBL3378139)
Ki 842±n/a nM
Citation Arnold, NBeattie, DBradley, MBrearley, ABrown, LCharlton, SJFairhurst, RAFarr, DFozard, JFullerton, JGosling, MHatto, JJanus, DJones, DJordan, LLewis, CMaas, JMcCarthy, CMercer, MOakman, HPress, NProfit, RSchuerch, FSykes, DTaylor, RJTrifilieff, ATuffnell, A The identification of 7-[(R)-2-((1S,2S)-2-benzyloxycyclopentylamino)-1-hydroxyethyl]-4-hydroxybenzothiazolone as an inhaled long-actingß2-adrenoceptor agonist. Bioorg Med Chem Lett24:4341-7 (2014) 
 
D(3) dopamine receptor
Name:D(3) dopamine receptor
Type:n/a
Mol. Mass.:44243.43
Organism:Homo sapiens (Human)
Description:n/a
Residue:400
BDBM50324856
NameBDBM50324856
Synonyms:7-((R)-2-((cis)-bi(cyclopentan)-2-ylamino)-1-hydroxyethyl)-4-hydroxybenzo[d]thiazol-2(3H)-one | CHEMBL1221682
TypeSmall organic molecule
Emp. Form.C19H26N2O3S
Mol. Mass.362.486
SMILESO[C@@H](CN[C@@H]1CCC[C@@H]1C1CCCC1)c1ccc(O)c2[nH]c(=O)sc12