Reaction Details
TargetBeta-1 adrenergic receptor
LigandBDBM50324856
Substrate/Competitorn/a
Meas. Tech.ChEMBL_1449715 (CHEMBL3378138)
Ki 17±n/a nM
Citation Arnold, NBeattie, DBradley, MBrearley, ABrown, LCharlton, SJFairhurst, RAFarr, DFozard, JFullerton, JGosling, MHatto, JJanus, DJones, DJordan, LLewis, CMaas, JMcCarthy, CMercer, MOakman, HPress, NProfit, RSchuerch, FSykes, DTaylor, RJTrifilieff, ATuffnell, A The identification of 7-[(R)-2-((1S,2S)-2-benzyloxycyclopentylamino)-1-hydroxyethyl]-4-hydroxybenzothiazolone as an inhaled long-actingß2-adrenoceptor agonist. Bioorg Med Chem Lett24:4341-7 (2014) 
 
Beta-1 adrenergic receptor
Name:Beta-1 adrenergic receptor
Type:G Protein-Coupled Receptor (GPCR)
Mol. Mass.:51338.40
Organism:Homo sapiens (Human)
Description:P08588
Residue:477
BDBM50324856
NameBDBM50324856
Synonyms:7-((R)-2-((cis)-bi(cyclopentan)-2-ylamino)-1-hydroxyethyl)-4-hydroxybenzo[d]thiazol-2(3H)-one | CHEMBL1221682
TypeSmall organic molecule
Emp. Form.C19H26N2O3S
Mol. Mass.362.486
SMILESO[C@@H](CN[C@@H]1CCC[C@@H]1C1CCCC1)c1ccc(O)c2[nH]c(=O)sc12