Reaction Details
TargetBeta-2 adrenergic receptor
LigandBDBM50055259
Substrate/Competitorn/a
Meas. Tech.ChEMBL_1449714 (CHEMBL3378137)
Ki 7.1±n/a nM
Citation Arnold, NBeattie, DBradley, MBrearley, ABrown, LCharlton, SJFairhurst, RAFarr, DFozard, JFullerton, JGosling, MHatto, JJanus, DJones, DJordan, LLewis, CMaas, JMcCarthy, CMercer, MOakman, HPress, NProfit, RSchuerch, FSykes, DTaylor, RJTrifilieff, ATuffnell, A The identification of 7-[(R)-2-((1S,2S)-2-benzyloxycyclopentylamino)-1-hydroxyethyl]-4-hydroxybenzothiazolone as an inhaled long-actingß2-adrenoceptor agonist. Bioorg Med Chem Lett24:4341-7 (2014) 
 
Beta-2 adrenergic receptor
Name:Beta-2 adrenergic receptor
Type:n/a
Mol. Mass.:46461.69
Organism:Homo sapiens (Human)
Description:P07550
Residue:413
BDBM50055259
NameBDBM50055259
Synonyms:CHEMBL3323660
TypeSmall organic molecule
Emp. Form.C21H24N2O3S
Mol. Mass.384.492
SMILESCc1ccccc1[C@H]1CCC[C@H]1NC[C@H](O)c1ccc(O)c2[nH]c(=O)sc12