Reaction Details
TargetDynamin-1
LigandBDBM50055859
Substrate/Competitorn/a
Meas. Tech.ChEMBL_1458576 (CHEMBL3371119)
IC50 36000±n/a nM
Citation MacGregor, KAAbdel-Hamid, MKOdell, LRChau, NWhiting, ARobinson, PJMcCluskey, A Development of quinone analogues as dynamin GTPase inhibitors. Eur J Med Chem85:191-206 (2014) 
 
Dynamin-1
Name:Dynamin-1
Type:PROTEIN
Mol. Mass.:97411.67
Organism:Homo sapiens (Human)
Description:ChEMBL_1458576
Residue:864
BDBM50055859
NameBDBM50055859
Synonyms:CHEMBL3329966
TypeSmall organic molecule
Emp. Form.C18H14N2O4
Mol. Mass.322.3148
SMILESOc1ccc(NC2=CC(=O)C(Nc3ccc(O)cc3)=CC2=O)cc1