Reaction Details
TargetNeuraminidase
LigandBDBM5025
Substrate/Competitorn/a
Meas. Tech.ChEMBL_1449777 (CHEMBL3378764)
IC50 1.4±n/a nM
Citation Rakers, CSchwerdtfeger, SMMortier, JDuwe, SWolff, TWolber, GMelzig, MF Inhibitory potency of flavonoid derivatives on influenza virus neuraminidase. Bioorg Med Chem Lett24:4312-7 (2014) 
 
Neuraminidase
Name:Neuraminidase
Type:PROTEIN
Mol. Mass.:51863.92
Organism:Influenza A virus (strain A/USSR/90/1977 H1N1)
Description:ChEMBL_109720
Residue:470
BDBM5025
NameBDBM5025
Synonyms:Oseltamivir ethyl (3R,4R,5S)-5-amino-4-acetamido-3-(pentan-3-yloxy)cyclohex-1-ene-1-carboxylate
TypeSmall organic molecule
Emp. Form.C16H28N2O4
Mol. Mass.312.4045
SMILES[H][C@@]1(OC(CC)CC)C=C(C[C@H](N)[C@H]1NC(C)=O)C(=O)OCC