Reaction Details
TargetNeuraminidase
LigandBDBM50056315
Substrate/Competitorn/a
Meas. Tech.ChEMBL_1449777 (CHEMBL3378764)
IC50 121200±n/a nM
Citation Rakers, CSchwerdtfeger, SMMortier, JDuwe, SWolff, TWolber, GMelzig, MF Inhibitory potency of flavonoid derivatives on influenza virus neuraminidase. Bioorg Med Chem Lett24:4312-7 (2014) 
 
Neuraminidase
Name:Neuraminidase
Type:PROTEIN
Mol. Mass.:51863.92
Organism:Influenza A virus (strain A/USSR/90/1977 H1N1)
Description:ChEMBL_109720
Residue:470
BDBM50056315
NameBDBM50056315
Synonyms:CHEBI:17558 | Quercitrin
TypeSmall organic molecule
Emp. Form.C21H20O11
Mol. Mass.448.3769
SMILESC[C@@H]1O[C@@H](Oc2c(oc3cc(O)cc(O)c3c2=O)-c2ccc(O)c(O)c2)[C@H](O)[C@H](O)[C@H]1O