Reaction Details
TargetLysophosphatidic acid receptor 2
LigandBDBM50148348
Substrate/Competitorn/a
Meas. Tech.ChEMBL_1451385 (CHEMBL3363669)
EC50 2.0±n/a nM
Citation Patil, RFells, JISzabó, ELim, KGNorman, DDBalogh, APatil, SStrobos, JMiller, DDTigyi, GJ Design and synthesis of sulfamoyl benzoic acid analogues with subnanomolar agonist activity specific to the LPA2 receptor. J Med Chem57:7136-40 (2014) 
 
Lysophosphatidic acid receptor 2
Name:Lysophosphatidic acid receptor 2
Type:PROTEIN
Mol. Mass.:39103.44
Organism:Homo sapiens (Human)
Description:ChEMBL_1451385
Residue:351
BDBM50148348
NameBDBM50148348
Synonyms:(R)-Octadec-9-enoic acid 2-hydroxy-3-phosphonooxy-propyl ester CHEMBL117021 | lysophosphatidic acid
TypeSmall organic molecule
Emp. Form.C21H41O7P
Mol. Mass.436.5198
SMILESCCCCCCCC\C=C/CCCCCCCC(=O)OC[C@@H](O)COP(O)(O)=O