Reaction Details
TargetC-C chemokine receptor type 1
LigandBDBM113727
Substrate/Competitorn/a
Meas. Tech.ChEMBL_1452284 (CHEMBL3366538)
IC50 3.0±n/a nM
Citation Santella, JBGardner, DSDuncia, JVWu, HDhar, MCavallaro, CTebben, AJCarter, PHBarrish, JCYarde, MBriceno, SWCvijic, MEGrafstrom, RRLiu, RPatel, SRWatson, AJYang, GRose, AVVickery, RDCaceres-Cortes, JCaporuscio, CCamac, DMKhan, JAAn, YFoster, WRDavies, PHynes, J Discovery of the CCR1 antagonist, BMS-817399, for the treatment of rheumatoid arthritis. J Med Chem57:7550-64 (2014) 
 
C-C chemokine receptor type 1
Name:C-C chemokine receptor type 1
Type:Enzyme
Mol. Mass.:41180.69
Organism:Homo sapiens (Human)
Description:P32246
Residue:355
BDBM113727
NameBDBM113727
Synonyms:US8633226, 897
TypeSmall organic molecule
Emp. Form.C23H36ClN3O3
Mol. Mass.438.003
SMILESCC[C@@H](C)NC(=O)N[C@H](C(C)C)C(=O)N1CC[C@](O)(c2ccc(Cl)cc2)C(C)(C)C1