Reaction Details
TargetC-C chemokine receptor type 1
LigandBDBM50056466
Substrate/Competitorn/a
Meas. Tech.ChEMBL_1452285 (CHEMBL3366539)
IC50 10.0±n/a nM
Citation Santella, JBGardner, DSDuncia, JVWu, HDhar, MCavallaro, CTebben, AJCarter, PHBarrish, JCYarde, MBriceno, SWCvijic, MEGrafstrom, RRLiu, RPatel, SRWatson, AJYang, GRose, AVVickery, RDCaceres-Cortes, JCaporuscio, CCamac, DMKhan, JAAn, YFoster, WRDavies, PHynes, J Discovery of the CCR1 antagonist, BMS-817399, for the treatment of rheumatoid arthritis. J Med Chem57:7550-64 (2014) 
 
C-C chemokine receptor type 1
Name:C-C chemokine receptor type 1
Type:Enzyme
Mol. Mass.:41180.69
Organism:Homo sapiens (Human)
Description:P32246
Residue:355
BDBM50056466
NameBDBM50056466
Synonyms:CHEMBL3334727
TypeSmall organic molecule
Emp. Form.C24H36ClN3O4
Mol. Mass.466.013
SMILESCC(C)[C@@H](NC(=O)N[C@H]1CC[C@H](O)C1)C(=O)N1CC[C@](O)(c2ccc(Cl)cc2)C(C)(C)C1