Reaction Details
TargetActivin receptor type-1
LigandBDBM102619
Substrate/Competitorn/a
Meas. Tech.ChEMBL_1453217 (CHEMBL3365510)
IC50 35±n/a nM
Citation Mohedas, AHWang, YSanvitale, CECanning, PChoi, SXing, XBullock, ANCuny, GDYu, PB Structure-activity relationship of 3,5-diaryl-2-aminopyridine ALK2 inhibitors reveals unaltered binding affinity for fibrodysplasia ossificans progressiva causing mutants. J Med Chem57:7900-15 (2014) 
 
Activin receptor type-1
Name:Activin receptor type-1
Type:n/a
Mol. Mass.:57158.32
Organism:Homo sapiens (Human)
Description:n/a
Residue:509
BDBM102619
NameBDBM102619
Synonyms:K02288a US11701353, Compound 382_0087_0284
TypeSmall organic molecule
Emp. Form.C20H20N2O4
Mol. Mass.352.3838
SMILESCOc1cc(cc(OC)c1OC)-c1cc(cnc1N)-c1cccc(O)c1