Reaction Details
TargetAndrogen receptor
LigandBDBM50057640
Substrate/Competitorn/a
Meas. Tech.ChEMBL_1448074 (CHEMBL3371979)
EC50 0.300000±n/a nM
Citation Ullrich, TSasmal, SBoorgu, VPasagadi, SCheera, SRajagopalan, SBhumireddy, AShashikumar, DChelur, SBelliappa, CPandit, CKrishnamurthy, NMukherjee, SRamanathan, AGhadiyaram, CRamachandra, MSantos, PGLagu, BBock, MGPerrone, MHWeiler, SKeller, H 3-alkoxy-pyrrolo[1,2-b]pyrazolines as selective androgen receptor modulators with ideal physicochemical properties for transdermal administration. J Med Chem57:7396-411 (2014) 
 
Androgen receptor
Name:Androgen receptor
Type:Receptor
Mol. Mass.:99185.27
Organism:Homo sapiens (Human)
Description:CHO cells were stably transfected with human AR gene.
Residue:920
BDBM50057640
NameBDBM50057640
Synonyms:CHEMBL3326466
TypeSmall organic molecule
Emp. Form.C15H14ClF2N3O
Mol. Mass.325.741
SMILES[H][C@@]12CC(F)(F)CN1N=C([C@H]2OC)c1ccc(C#N)c(Cl)c1C