Reaction Details
TargetM-phase inducer phosphatase 2
LigandBDBM50057658
Substrate/Competitorn/a
Meas. Tech.ChEMBL_1448895 (CHEMBL3375097)
IC50 8540±n/a nM
Citation Li, YYu, YJin, KGao, LLuo, TSheng, LShao, XLi, J Synthesis and biological evaluation of novel thiadiazole amides as potent Cdc25B and PTP1B inhibitors. Bioorg Med Chem Lett24:4125-8 (2014) 
 
M-phase inducer phosphatase 2
Name:M-phase inducer phosphatase 2
Type:Protein
Mol. Mass.:64985.27
Organism:Homo sapiens (Human)
Description:n/a
Residue:580
BDBM50057658
NameBDBM50057658
Synonyms:CHEMBL3322840
TypeSmall organic molecule
Emp. Form.C21H13N5O6S
Mol. Mass.463.423
SMILES[O-][N+](=O)c1ccc(Oc2ccc(cc2)-c2nnc(NC(=O)c3ccc(cc3)[N+]([O-])=O)s2)cc1