Reaction Details
TargetM-phase inducer phosphatase 2
LigandBDBM50057667
Substrate/Competitorn/a
Meas. Tech.ChEMBL_1448895 (CHEMBL3375097)
IC50 4430±n/a nM
Citation Li, YYu, YJin, KGao, LLuo, TSheng, LShao, XLi, J Synthesis and biological evaluation of novel thiadiazole amides as potent Cdc25B and PTP1B inhibitors. Bioorg Med Chem Lett24:4125-8 (2014) 
 
M-phase inducer phosphatase 2
Name:M-phase inducer phosphatase 2
Type:Protein
Mol. Mass.:64985.27
Organism:Homo sapiens (Human)
Description:n/a
Residue:580
BDBM50057667
NameBDBM50057667
Synonyms:CHEMBL3322852
TypeSmall organic molecule
Emp. Form.C21H12ClN5O6S
Mol. Mass.497.868
SMILES[O-][N+](=O)c1ccc(Oc2ccc(cc2)-c2nnc(NC(=O)c3ccc(Cl)cc3)s2)c(c1)[N+]([O-])=O