Reaction Details
TargetMannose-6-phosphate isomerase
LigandBDBM46036
Substrate/Competitorn/a
Meas. Tech.ChEMBL_1448919 (CHEMBL3375686)
IC50 710±n/a nM
Citation Bravo, YTeriete, PDhanya, RPDahl, RLee, PSKiffer-Moreira, TGanji, SRSergienko, ESmith, LHFarquharson, CMillán, JLCosford, ND Design, synthesis and evaluation of benzoisothiazolones as selective inhibitors of PHOSPHO1. Bioorg Med Chem Lett24:4308-11 (2014) 
 
Mannose-6-phosphate isomerase
Name:Mannose-6-phosphate isomerase
Type:PROTEIN
Mol. Mass.:46651.35
Organism:Homo sapiens (Human)
Description:ChEMBL_1448919
Residue:423
BDBM46036
NameBDBM46036
Synonyms:2-[[3-(3-keto-1,2-benzothiazol-2-yl)phenyl]sulfonylamino]benzoic acid 2-[[3-(3-oxo-1,2-benzothiazol-2-yl)phenyl]sulfonylamino]benzoic acid cid_4089709
TypeSmall organic molecule
Emp. Form.C20H14N2O5S2
Mol. Mass.426.466
SMILESOC(=O)c1ccccc1NS(=O)(=O)c1cccc(c1)-n1sc2ccccc2c1=O