Reaction Details
TargetPhosphoethanolamine/phosphocholine phosphatase
LigandBDBM34340
Substrate/Competitorn/a
Meas. Tech.ChEMBL_1448918 (CHEMBL3375685)
IC50 1800±n/a nM
Citation Bravo, YTeriete, PDhanya, RPDahl, RLee, PSKiffer-Moreira, TGanji, SRSergienko, ESmith, LHFarquharson, CMillán, JLCosford, ND Design, synthesis and evaluation of benzoisothiazolones as selective inhibitors of PHOSPHO1. Bioorg Med Chem Lett24:4308-11 (2014) 
 
Phosphoethanolamine/phosphocholine phosphatase
Name:Phosphoethanolamine/phosphocholine phosphatase
Type:Enzyme Catalytic Domain
Mol. Mass.:29718.09
Organism:Homo sapiens (Human)
Description:Q8TCT1
Residue:267
BDBM34340
NameBDBM34340
Synonyms:2-(4-methyl-3-piperidin-1-ylsulfonyl-phenyl)-1,2-benzothiazol-3-one 2-(4-methyl-3-piperidinosulfonyl-phenyl)-1,2-benzothiazol-3-one MLS000057572 cid_2327953
TypeSmall organic molecule
Emp. Form.C19H20N2O3S2
Mol. Mass.388.504
SMILESCc1ccc(cc1S(=O)(=O)N1CCCCC1)-n1sc2ccccc2c1=O