Reaction Details
TargetGlucagon receptor
LigandBDBM50122102
Substrate/Competitorn/a
Meas. Tech.ChEMBL_1450605 (CHEMBL3372726)
IC50 2.3±n/a nM
Citation Hasegawa, FNiidome, KMigihashi, CMurata, MNegoro, TMatsumoto, TKato, KFujii, A Discovery of furan-2-carbohydrazides as orally active glucagon receptor antagonists. Bioorg Med Chem Lett24:4266-70 (2014) 
 
Glucagon receptor
Name:Glucagon receptor
Type:Enzyme
Mol. Mass.:54026.92
Organism:Homo sapiens (Human)
Description:P47871
Residue:477
BDBM50122102
NameBDBM50122102
Synonyms:3-Cyano-4-hydroxy-benzoic acid [1-(2,3,5,6-tetramethyl-benzyl)-1H-indol-4-ylmethylene]-hydrazide N'-((1-(2,3,5,6-tetramethylbenzyl)-1H-indol-4-yl)methylene)-3-cyano-4-hydroxybenzohydrazide
TypeSmall organic molecule
Emp. Form.C28H26N4O2
Mol. Mass.450.5316
SMILESCc1cc(C)c(C)c(Cn2ccc3c(\C=N\NC(=O)c4ccc(O)c(c4)C#N)cccc23)c1C