Reaction Details
TargetGlucagon receptor
LigandBDBM50057824
Substrate/Competitorn/a
Meas. Tech.ChEMBL_1450588 (CHEMBL3372166)
IC50 87±n/a nM
Citation Hasegawa, FNiidome, KMigihashi, CMurata, MNegoro, TMatsumoto, TKato, KFujii, A Discovery of furan-2-carbohydrazides as orally active glucagon receptor antagonists. Bioorg Med Chem Lett24:4266-70 (2014) 
 
Glucagon receptor
Name:Glucagon receptor
Type:PROTEIN
Mol. Mass.:55053.40
Organism:Rattus norvegicus
Description:ChEMBL_1450588
Residue:485
BDBM50057824
NameBDBM50057824
Synonyms:CHEMBL3326175
TypeSmall organic molecule
Emp. Form.C24H17N3O6
Mol. Mass.443.4083
SMILESOc1ccc(cc1[N+]([O-])=O)C(=O)NNC(=O)c1occ(c1-c1ccccc1)-c1ccccc1