Reaction Details
TargetTransient receptor potential cation channel subfamily V member 1
LigandBDBM50061358
Substrate/Competitorn/a
Meas. Tech.ChEMBL_1461538 (CHEMBL3396779)
Ki 8.4±n/a nM
Citation Sun, WKim, HSLee, SJung, AKim, SEAnn, JYoon, SChoi, SLee, JHBlumberg, PMFrank-Foltyn, RBahrenberg, GSchiene, KStockhausen, HChristoph, TFrormann, SLee, J 6,6-Fused heterocyclic ureas as highly potent TRPV1 antagonists. Bioorg Med Chem Lett25:803-6 (2015) 
 
Transient receptor potential cation channel subfamily V member 1
Name:Transient receptor potential cation channel subfamily V member 1
Type:Protein
Mol. Mass.:94960.75
Organism:Homo sapiens (Human)
Description:Q8NER1
Residue:839
BDBM50061358
NameBDBM50061358
Synonyms:CHEMBL3393827
TypeSmall organic molecule
Emp. Form.C23H24F3N5O
Mol. Mass.443.4648
SMILESCC1CCN(CC1)c1nc(ccc1CNC(=O)Nc1ccc2ccncc2c1)C(F)(F)F