Reaction Details
TargetFatty acid-binding protein, heart
LigandBDBM50063855
Substrate/Competitorn/a
Meas. Tech.ChEMBL_1463783 (CHEMBL3404793)
IC50 230±n/a nM
Citation Cai, HLiu, QGao, DWang, TChen, TYan, GChen, KXu, YWang, HLi, YZhu, W Novel fatty acid binding protein 4 (FABP4) inhibitors: virtual screening, synthesis and crystal structure determination. Eur J Med Chem90:241-50 (2015) 
 
Fatty acid-binding protein, heart
Name:Fatty acid-binding protein, heart
Type:PROTEIN
Mol. Mass.:14858.36
Organism:Homo sapiens (Human)
Description:ChEMBL_1463784
Residue:133
BDBM50063855
NameBDBM50063855
Synonyms:CHEMBL3400905
TypeSmall organic molecule
Emp. Form.C16H24O2
Mol. Mass.248.3606
SMILESCC(C)c1cc(C(C)C)c(C(O)=O)c(c1)C(C)C