Reaction Details
TargetPhosphatidylinositol 4,5-bisphosphate 3-kinase catalytic subunit beta isoform
LigandBDBM50064860
Substrate/Competitorn/a
Meas. Tech.ChEMBL_1465178 (CHEMBL3405879)
IC50 394±n/a nM
Citation Yin, YZhang, YQJin, BSha, SWu, XSangani, CBWang, SFQiao, FLu, AMLv, PCZhu, HL 6,7-Dihydrobenzo[f]benzo[4,5]imidazo[1,2-d][1,4]oxazepine derivatives as selective inhibitors of PI3Ka. Bioorg Med Chem23:1231-40 (2015) 
 
Phosphatidylinositol 4,5-bisphosphate 3-kinase catalytic subunit beta isoform
Name:Phosphatidylinositol 4,5-bisphosphate 3-kinase catalytic subunit beta isoform
Type:Enzyme Subunit
Mol. Mass.:122769.00
Organism:Homo sapiens (Human)
Description:P42338
Residue:1070
BDBM50064860
NameBDBM50064860
Synonyms:CHEMBL3403813
TypeSmall organic molecule
Emp. Form.C17H16N2O
Mol. Mass.264.3217
SMILESCc1ccc2OCCn3c(nc4cc(C)ccc34)-c2c1