Reaction Details
TargetPhosphatidylinositol 4,5-bisphosphate 3-kinase catalytic subunit alpha isoform
LigandBDBM50064861
Substrate/Competitorn/a
Meas. Tech.ChEMBL_1465177 (CHEMBL3405878)
IC50 685±n/a nM
Citation Yin, YZhang, YQJin, BSha, SWu, XSangani, CBWang, SFQiao, FLu, AMLv, PCZhu, HL 6,7-Dihydrobenzo[f]benzo[4,5]imidazo[1,2-d][1,4]oxazepine derivatives as selective inhibitors of PI3Ka. Bioorg Med Chem23:1231-40 (2015) 
 
Phosphatidylinositol 4,5-bisphosphate 3-kinase catalytic subunit alpha isoform
Name:Phosphatidylinositol 4,5-bisphosphate 3-kinase catalytic subunit alpha isoform
Type:Enzyme Subunit
Mol. Mass.:124294.87
Organism:Homo sapiens (Human)
Description:P42336
Residue:1068
BDBM50064861
NameBDBM50064861
Synonyms:CHEMBL3401259
TypeSmall organic molecule
Emp. Form.C17H13F3N2O
Mol. Mass.318.2931
SMILESCc1ccc2OCCn3c(nc4cc(ccc34)C(F)(F)F)-c2c1