Reaction Details
TargetAmine oxidase [flavin-containing] A
LigandBDBM50065382
Substrate/Competitorn/a
Meas. Tech.ChEMBL_1465742 (CHEMBL3405677)
IC50 37000±n/a nM
Citation Nowotarski, SLPachaiyappan, BHolshouser, SLKutz, CJLi, YHuang, YSharma, SKCasero, RAWoster, PM Structure-activity study for (bis)ureidopropyl- and (bis)thioureidopropyldiamine LSD1 inhibitors with 3-5-3 and 3-6-3 carbon backbone architectures. Bioorg Med Chem23:1601-12 (2015) 
 
Amine oxidase [flavin-containing] A
Name:Amine oxidase [flavin-containing] A
Type:Protein
Mol. Mass.:59689.53
Organism:Homo sapiens (Human)
Description:P21397
Residue:527
BDBM50065382
NameBDBM50065382
Synonyms:CHEMBL1085949
TypeSmall organic molecule
Emp. Form.C47H69ClN12
Mol. Mass.837.584
SMILESCl.N=C(NCCCNCCCCCCCNCCCNC(=N)NC(=N)NCCC(c1ccccc1)c1ccccc1)NC(=N)NCCC(c1ccccc1)c1ccccc1