Reaction Details
TargetAmine oxidase [flavin-containing] B
LigandBDBM50065385
Substrate/Competitorn/a
Meas. Tech.ChEMBL_1465744 (CHEMBL3405679)
IC50 27000±n/a nM
Citation Nowotarski, SLPachaiyappan, BHolshouser, SLKutz, CJLi, YHuang, YSharma, SKCasero, RAWoster, PM Structure-activity study for (bis)ureidopropyl- and (bis)thioureidopropyldiamine LSD1 inhibitors with 3-5-3 and 3-6-3 carbon backbone architectures. Bioorg Med Chem23:1601-12 (2015) 
 
Amine oxidase [flavin-containing] B
Name:Amine oxidase [flavin-containing] B
Type:Protein
Mol. Mass.:58768.76
Organism:Homo sapiens (Human)
Description:P27338
Residue:520
BDBM50065385
NameBDBM50065385
Synonyms:CHEMBL3401326
TypeSmall organic molecule
Emp. Form.C41H55ClN6S2
Mol. Mass.731.499
SMILESCl.S=C(NCCCNCCCCCNCCCNC(=S)NCC(c1ccccc1)c1ccccc1)NCC(c1ccccc1)c1ccccc1