Reaction Details
TargetHepatocyte growth factor receptor
LigandBDBM50065489
Substrate/Competitorn/a
Meas. Tech.ChEMBL_1466073 (CHEMBL3404456)
IC50 15±n/a nM
Citation Dorsch, DSchadt, OStieber, FMeyring, MGrädler, UBladt, FFriese-Hamim, MKnühl, CPehl, UBlaukat, A Identification and optimization of pyridazinones as potent and selective c-Met kinase inhibitors. Bioorg Med Chem Lett25:1597-602 (2015) 
 
Hepatocyte growth factor receptor
Name:Hepatocyte growth factor receptor
Type:Protein
Mol. Mass.:155559.73
Organism:Homo sapiens (Human)
Description:P08581
Residue:1390
BDBM50065489
NameBDBM50065489
Synonyms:CHEMBL3402756
TypeSmall organic molecule
Emp. Form.C26H25F2N5O2
Mol. Mass.477.5058
SMILESCN(C)CCCOc1cnc(nc1)-c1cccc(Cn2nc(ccc2=O)-c2cc(F)cc(F)c2)c1