Reaction Details
TargetHepatocyte growth factor receptor
LigandBDBM50065492
Substrate/Competitorn/a
Meas. Tech.ChEMBL_1466073 (CHEMBL3404456)
IC50 78±n/a nM
Citation Dorsch, DSchadt, OStieber, FMeyring, MGrädler, UBladt, FFriese-Hamim, MKnühl, CPehl, UBlaukat, A Identification and optimization of pyridazinones as potent and selective c-Met kinase inhibitors. Bioorg Med Chem Lett25:1597-602 (2015) 
 
Hepatocyte growth factor receptor
Name:Hepatocyte growth factor receptor
Type:Protein
Mol. Mass.:155559.73
Organism:Homo sapiens (Human)
Description:P08581
Residue:1390
BDBM50065492
NameBDBM50065492
Synonyms:CHEMBL3402742
TypeSmall organic molecule
Emp. Form.C22H24F2N4O3S
Mol. Mass.462.513
SMILESCN(C)CCCOC(=O)Nc1cccc(CN2N=C(CSC2=O)c2cc(F)cc(F)c2)c1