Reaction Details
TargetHepatocyte growth factor receptor
LigandBDBM50065486
Substrate/Competitorn/a
Meas. Tech.ChEMBL_1466072 (CHEMBL3404455)
IC50 5.7±n/a nM
Citation Dorsch, DSchadt, OStieber, FMeyring, MGrädler, UBladt, FFriese-Hamim, MKnühl, CPehl, UBlaukat, A Identification and optimization of pyridazinones as potent and selective c-Met kinase inhibitors. Bioorg Med Chem Lett25:1597-602 (2015) 
 
Hepatocyte growth factor receptor
Name:Hepatocyte growth factor receptor
Type:Protein
Mol. Mass.:155559.73
Organism:Homo sapiens (Human)
Description:P08581
Residue:1390
BDBM50065486
NameBDBM50065486
Synonyms:CHEMBL3402759
TypeSmall organic molecule
Emp. Form.C27H29N5O3
Mol. Mass.471.5509
SMILESCOc1cccc(c1)-c1ccc(=O)n(Cc2cccc(c2)-c2ncc(OCCCN(C)C)cn2)n1