Reaction Details
TargetCathepsin D
LigandBDBM50065660
Substrate/Competitorn/a
Meas. Tech.ChEMBL_1464647 (CHEMBL3406668)
IC50>30000±n/a nM
Citation Sellner, HCottens, SCumin, FEhrhardt, CKosaka, TLorthiois, EOstermann, NWebb, RLRigel, DFWagner, TMaibaum, J trans-3,4-Disubstituted pyrrolidines as inhibitors of the human aspartyl protease renin. Part II: prime site exploration using an oxygen linker. Bioorg Med Chem Lett25:1787-91 (2015) 
 
Cathepsin D
Name:Cathepsin D
Type:Enzyme
Mol. Mass.:44551.72
Organism:Homo sapiens (Human)
Description:Human proCathepsin D (SwissProt accession number P07339) was expressed in Sf9 cells, purified, and autoactivated.
Residue:412
BDBM50065660
NameBDBM50065660
Synonyms:CHEMBL3403995
TypeSmall organic molecule
Emp. Form.C28H39N3O6
Mol. Mass.513.6258
SMILESCOCCCOc1cc(ccc1OC)C(=O)N(C[C@@H]1CNC[C@H]1OC(=O)NCc1ccccc1)C(C)C