Reaction Details
TargetRenin
LigandBDBM50065665
Substrate/Competitorn/a
Meas. Tech.ChEMBL_1464636 (CHEMBL3406487)
IC50 9.0±n/a nM
Citation Sellner, HCottens, SCumin, FEhrhardt, CKosaka, TLorthiois, EOstermann, NWebb, RLRigel, DFWagner, TMaibaum, J trans-3,4-Disubstituted pyrrolidines as inhibitors of the human aspartyl protease renin. Part II: prime site exploration using an oxygen linker. Bioorg Med Chem Lett25:1787-91 (2015) 
 
Renin
Name:Renin
Type:Enzyme
Mol. Mass.:45058.99
Organism:Homo sapiens (Human)
Description:n/a
Residue:406
BDBM50065665
NameBDBM50065665
Synonyms:CHEMBL3404004
TypeSmall organic molecule
Emp. Form.C33H44N4O6
Mol. Mass.592.7257
SMILESCOCCCOc1cc(ccc1OC)C(=O)N(C[C@@H]1CNC[C@H]1OC(=O)N(C)Cc1ccccc1-n1cccc1)C(C)C