Reaction Details
TargetKappa-type opioid receptor
LigandBDBM50066358
Substrate/Competitorn/a
Meas. Tech.ChEMBL_1465624 (CHEMBL3405072)
Ki 6.8±n/a nM
Citation Yuan, YZaidi, SAStevens, DLScoggins, KLMosier, PDKellogg, GEDewey, WLSelley, DEZhang, Y Design, syntheses, and pharmacological characterization of 17-cyclopropylmethyl-3,14ß-dihydroxy-4,5a-epoxy-6a-(isoquinoline-3'-carboxamido)morphinan analogues as opioid receptor ligands. Bioorg Med Chem23:1701-15 (2015) 
 
Kappa-type opioid receptor
Name:Kappa-type opioid receptor
Type:Enzyme
Mol. Mass.:42656.78
Organism:Mus musculus (Mouse)
Description:P33534
Residue:380
BDBM50066358
NameBDBM50066358
Synonyms:CHEMBL2419117
TypeSmall organic molecule
Emp. Form.C31H37N3O4
Mol. Mass.515.6432
SMILES[H][C@@]12Oc3c4c(C[C@@]5([H])N(CC6CC6)CC[C@@]14[C@@]5(O)CC[C@@H]2NC(=O)[C@@H]1Cc2ccccc2CN1C)ccc3O