Reaction Details
TargetMu-type opioid receptor
LigandBDBM50066284
Substrate/Competitorn/a
Meas. Tech.ChEMBL_1465628 (CHEMBL3405076)
EC50 6.0±n/a nM
Citation Yuan, YZaidi, SAStevens, DLScoggins, KLMosier, PDKellogg, GEDewey, WLSelley, DEZhang, Y Design, syntheses, and pharmacological characterization of 17-cyclopropylmethyl-3,14ß-dihydroxy-4,5a-epoxy-6a-(isoquinoline-3'-carboxamido)morphinan analogues as opioid receptor ligands. Bioorg Med Chem23:1701-15 (2015) 
 
Mu-type opioid receptor
Name:Mu-type opioid receptor
Type:Enzyme Catalytic Domain
Mol. Mass.:44431.62
Organism:MOUSE
Description:OPIATE Mu OPRM1 MOUSE::P42866
Residue:398
BDBM50066284
NameBDBM50066284
Synonyms:CHEMBL2419123
TypeSmall organic molecule
Emp. Form.C29H30N4O4
Mol. Mass.498.5729
SMILES[H][C@@]12Oc3c4c(C[C@@]5([H])N(CC6CC6)CC[C@@]14[C@@]5(O)CC[C@@H]2NC(=O)c1ncc2ccccc2n1)ccc3O