Reaction Details
TargetCysteinyl leukotriene receptor 1
LigandBDBM50066911
Substrate/Competitorn/a
Meas. Tech.ChEMBL_1466140 (CHEMBL3404758)
IC50 0.790000±n/a nM
Citation Itadani, STakahashi, SIma, MSekiguchi, TAratani, YEgashira, HMatsumura, NInoue, AYonetomi, YFujita, MNakayama, YTakeuchi, J Discovery of a potent, orally available dual CysLT1 and CysLT2 antagonist with dicarboxylic acid. Bioorg Med Chem23:2079-97 (2015) 
 
Cysteinyl leukotriene receptor 1
Name:Cysteinyl leukotriene receptor 1
Type:Enzyme Catalytic Domain
Mol. Mass.:38565.16
Organism:Homo sapiens (Human)
Description:Leukotriene Cysteinyl 1 CYSLTR1 HUMAN::Q9Y271
Residue:337
BDBM50066911
NameBDBM50066911
Synonyms:CHEMBL3401689
TypeSmall organic molecule
Emp. Form.C30H32N6O5
Mol. Mass.556.6123
SMILESOC(=O)CCCN1CC(Oc2c(NC(=O)c3ccc(OCCCCc4ccccc4)cc3)cccc12)c1nnn[nH]1