Reaction Details
TargetAndrogen receptor
LigandBDBM50068096
Substrate/Competitorn/a
Meas. Tech.ChEMBL_1463778 (CHEMBL3404788)
EC50 160±n/a nM
Citation Aikawa, KMiyawaki, THitaka, TImai, YNHara, TMiyazaki, JYamaoka, MKusaka, MKanzaki, NTasaka, AShiraishi, MYamamoto, S Synthesis and biological evaluation of novel selective androgen receptor modulators (SARMs). Part I. Bioorg Med Chem23:2568-78 (2015) 
 
Androgen receptor
Name:Androgen receptor
Type:Receptor
Mol. Mass.:99185.27
Organism:Homo sapiens (Human)
Description:CHO cells were stably transfected with human AR gene.
Residue:920
BDBM50068096
NameBDBM50068096
Synonyms:CHEMBL3402227
TypeSmall organic molecule
Emp. Form.C16H13N3
Mol. Mass.247.2945
SMILESN#C[C@H]1CCCN1c1ccc(C#N)c2ccccc12