Reaction Details
TargetAndrogen receptor
LigandBDBM50068100
Substrate/Competitorn/a
Meas. Tech.ChEMBL_1463778 (CHEMBL3404788)
EC50 1.2±n/a nM
Citation Aikawa, KMiyawaki, THitaka, TImai, YNHara, TMiyazaki, JYamaoka, MKusaka, MKanzaki, NTasaka, AShiraishi, MYamamoto, S Synthesis and biological evaluation of novel selective androgen receptor modulators (SARMs). Part I. Bioorg Med Chem23:2568-78 (2015) 
 
Androgen receptor
Name:Androgen receptor
Type:Receptor
Mol. Mass.:99185.27
Organism:Homo sapiens (Human)
Description:CHO cells were stably transfected with human AR gene.
Residue:920
BDBM50068100
NameBDBM50068100
Synonyms:CHEMBL3402231
TypeSmall organic molecule
Emp. Form.C17H18N2O
Mol. Mass.266.3376
SMILESC[C@H]1[C@@H](CO)CCN1c1ccc(C#N)c2ccccc12